Target
Histone deacetylase 6
Ligand
BDBM50439674
Substrate
Meas. Tech.
Enzyme Assays
pH
7.4±0
IC50
10±0.0 nM
Citation
 Van Duzer, JHMazitschek, ROgier, WBradner, JEHuang, GXie, DYu, N Reverse amide compounds as protein deacetylase inhibitors and methods of use thereof US Patent  US8609678 Publication Date 12/17/2013 
Target
Name:
Histone deacetylase 6
Synonyms:
Cereblon/Histone deacetylase 6 HDAC6 Histone deacetylase 6 (HDAC6) KIAA0901 | ORF Names:JM21
Type:
Chromatin regulator; hydrolase; repressor
Mol. Mass.:
131381.51
Organism:
Homo sapiens (Human)
Description:
Q9UBN7
Residue:
1215
  
Inhibitor
Name:
BDBM50439674
Synonyms:
RICOLINOSTAT US11207431, Example E US8609678, 2-(diphenylamino)-N-(7-(hydroxyamino)-7-oxoheptyl)pyrimidine-5-carboxamide [26]
Type:
Small organic molecule
Emp. Form.:
C24H27N5O3
Mol. Mass.:
433.5029
SMILES:
ONC(=O)CCCCCCNC(=O)c1cnc(nc1)N(c1ccccc1)c1ccccc1
: