Target
Histone deacetylase 6
Ligand
BDBM110105
Substrate
Meas. Tech.
Enzyme Assays
pH
7.4±0
IC50
3±0.0 nM
Citation
 Van Duzer, JHMazitschek, ROgier, WBradner, JEHuang, GXie, DYu, N Reverse amide compounds as protein deacetylase inhibitors and methods of use thereof US Patent  US8609678 Publication Date 12/17/2013 
Target
Name:
Histone deacetylase 6
Synonyms:
Cereblon/Histone deacetylase 6 HDAC6 Histone deacetylase 6 (HDAC6) KIAA0901 | ORF Names:JM21
Type:
Chromatin regulator; hydrolase; repressor
Mol. Mass.:
131381.51
Organism:
Homo sapiens (Human)
Description:
Q9UBN7
Residue:
1215
  
Inhibitor
Name:
BDBM110105
Synonyms:
US8609678, 3-((4-(7-(hydroxyamino)-7-oxoheptylcarbamoyl)phenyl)(methoxy)(phenyl)methyl)-N,N-dimethylbenzamide [158]
Type:
Small organic molecule
Emp. Form.:
C31H37N3O5
Mol. Mass.:
531.6426
SMILES:
COC(c1ccccc1)(c1ccc(cc1)C(=O)NCCCCCCC(=O)NO)c1cccc(c1)C(=O)N(C)C
: