Target
Histone deacetylase 6
Ligand
BDBM110073
Substrate
Meas. Tech.
Enzyme Assays
pH
7.4±0
IC50
74±0.0 nM
Citation
 Van Duzer, JHMazitschek, ROgier, WBradner, JEHuang, GXie, DYu, N Reverse amide compounds as protein deacetylase inhibitors and methods of use thereof US Patent  US8609678 Publication Date 12/17/2013 
Target
Name:
Histone deacetylase 6
Synonyms:
Cereblon/Histone deacetylase 6 HDAC6 Histone deacetylase 6 (HDAC6) KIAA0901 | ORF Names:JM21
Type:
Chromatin regulator; hydrolase; repressor
Mol. Mass.:
131381.51
Organism:
Homo sapiens (Human)
Description:
Q9UBN7
Residue:
1215
  
Inhibitor
Name:
BDBM110073
Synonyms:
US8609678, 4-(bis(2-fluorophenyl)(hydroxy)methyl)-N-(7-(hydroxyamino)-7-oxoheptyl)benzamide [126]
Type:
Small organic molecule
Emp. Form.:
C27H28F2N2O4
Mol. Mass.:
482.519
SMILES:
ONC(=O)CCCCCCNC(=O)c1ccc(cc1)C(O)(c1ccccc1F)c1ccccc1F
: