Target
Histone deacetylase 6
Ligand
BDBM110090
Substrate
Meas. Tech.
Enzyme Assays
pH
7.4±0
IC50
361±0.0 nM
Citation
 Van Duzer, JHMazitschek, ROgier, WBradner, JEHuang, GXie, DYu, N Reverse amide compounds as protein deacetylase inhibitors and methods of use thereof US Patent  US8609678 Publication Date 12/17/2013 
Target
Name:
Histone deacetylase 6
Synonyms:
Cereblon/Histone deacetylase 6 HDAC6 Histone deacetylase 6 (HDAC6) KIAA0901 | ORF Names:JM21
Type:
Chromatin regulator; hydrolase; repressor
Mol. Mass.:
131381.51
Organism:
Homo sapiens (Human)
Description:
Q9UBN7
Residue:
1215
  
Inhibitor
Name:
BDBM110090
Synonyms:
US8609678, 4-((4-fluorophenyl)(methoxy)(pyridin-2-yl)methyl)-N-(7-(hydroxyamino)-7-oxoheptyl)-N-methylbenzamide [143]
Type:
Small organic molecule
Emp. Form.:
C28H32FN3O4
Mol. Mass.:
493.5698
SMILES:
COC(c1ccc(F)cc1)(c1ccc(cc1)C(=O)N(C)CCCCCCC(=O)NO)c1ccccn1
: