Target
Urease [D459Y,K653P]
Ligand
BDBM50099857
Substrate
Meas. Tech.
Urease Inhibition Assay
pH
8.2±n/a
Temperature
310.15±n/a K
IC50
4.32e+4± 2.6e+3 nM
Comments
extracted
Citation
 Saeed, AKhan, MSRafique, HShahid, MIqbal, J Design, synthesis, molecular docking studies and in vitro screening of ethyl 4-(3-benzoylthioureido) benzoates as urease inhibitors. Bioorg Chem 52:1-7 (2014)  
Target
Name:
Urease [D459Y,K653P]
Synonyms:
UREA_CANEN Urease
Type:
Protein
Mol. Mass.:
90763.23
Organism:
Canavalia ensiformis (Jack bean)
Description:
P07374[D459Y,K653P]
Residue:
840
  
Inhibitor
Name:
BDBM50099857
Synonyms:
ACETOHYDROXAMIC ACID (AHA) Acethydroxamsaeure Acetic acid, oxime Cetohyroxamic acid Methylhydroxamic acid N-Acetylhydroxylamine acetohydroxamic acid
Type:
Small organic molecule
Emp. Form.:
C2H5NO2
Mol. Mass.:
75.0666
SMILES:
CC(=O)NO
: