Target
Calpain-1 catalytic subunit
Ligand
BDBM16509
Substrate
Meas. Tech.
µ-Calpain Inhibition Assay
pH
7.5±n/a
Temperature
298.15±n/a K
IC50
>1.00e+5±n/a nM
Comments
extracted
Citation
 Baek, KHKarki, RLee, ESNa, YKwon, Y Synthesis and investigation of dihydroxychalcones as calpain and cathepsin inhibitors. Bioorg Chem 51:24-30 (2013)  
Target
Name:
Calpain-1 catalytic subunit
Synonyms:
CAN1_HUMAN CAPN1 Calpain-1 (u-Calpain) Calpain1
Type:
Protein
Mol. Mass.:
81880.51
Organism:
Homo sapiens (Human)
Description:
Residue:
714
  
Inhibitor
Name:
BDBM16509
Synonyms:
(2S)-1-[(2S,3S)-3-methyl-2-{[(2S,3S)-3-(propylcarbamoyl)oxiran-2-yl]formamido}pentanoyl]pyrrolidine-2-carboxylic acid CHEMBL490920 PrNH-tES-Ile-Pro-OH | epoxysuccinyl derivative CA074
Type:
Small organic molecule
Emp. Form.:
C18H29N3O6
Mol. Mass.:
383.4394
SMILES:
[H][C@@]1(O[C@]1([H])C(=O)N[C@@H]([C@@H](C)CC)C(=O)N1CCC[C@H]1C(O)=O)C(=O)NCCC
: