Target
Tyrosine-protein kinase CSK
Ligand
BDBM50142887
Substrate
Meas. Tech.
c-Src Kinase Inhibitory Activity Assay
pH
7.5±n/a
Temperature
298.15±n/a K
IC50
5e+2±n/a nM
Comments
extracted
Citation
 Chand, KPrasad, STiwari, RKShirazi, ANKumar, SParang, KSharma, SK Synthesis and evaluation of c-Src kinase inhibitory activity of pyridin-2(1H)-one derivatives. Bioorg Chem 53:75-82 (2014)  
Target
Name:
Tyrosine-protein kinase CSK
Synonyms:
C-SRC kinase CSK Protein-tyrosine kinase CYL | Tyrosine Kinase CSK
Type:
Tyrosine-protein kinase
Mol. Mass.:
50707.30
Organism:
Homo sapiens (Human)
Description:
P41240
Residue:
450
  
Inhibitor
Name:
BDBM50142887
Synonyms:
1-(tert-butyl)-3-(4-chlorophenyl)-4-aminopyrazolo[3,4-d]pyrimidine 1-tert-butyl-3-(4-chlorophenyl)-1H-pyrazolo[3,4-d]pyrimidin-4-amine 4-amino-5-(4-chlorophenyl)-7-(tert-butyl)pyrazolo[3,4-d]pyrimidine CHEMBL406845 US10544104, Compound 146 US11701353, PP2 (Pfizer) cid_4878
Type:
Small organic molecule
Emp. Form.:
C15H16ClN5
Mol. Mass.:
301.774
SMILES:
CC(C)(C)n1nc(-c2ccc(Cl)cc2)c2c(N)ncnc12
: