Target
3-phosphoinositide-dependent protein kinase 1 [51-359]
Ligand
BDBM281804
Substrate
Meas. Tech.
PDK1 kinase assay
IC50
<100±n/a nM
Citation
 Arndt, JChan, TGuckian, KKumaravel, GLee, WLin, EYScott, DSun, LThomas, Jvan Vloten, KWang, DZhang, LErlanson, D Heterocyclic compounds useful as PDK1 inhibitors US Patent  US10030016 Publication Date 7/24/2018 
Target
Name:
3-phosphoinositide-dependent protein kinase 1 [51-359]
Synonyms:
3-Phosphoinositide-Dependent Protein Kinase 1 (PDK1) 3-phosphoinositide-dependent protein kinase 1 (aa 51-359) PDK1 (aa 51-359) PDPK1_HUMAN | hPDK1
Type:
Enzyme Catalytic Domain
Mol. Mass.:
35302.26
Organism:
Homo sapiens (Human)
Description:
O15530[51-359]
Residue:
309
  
Inhibitor
Name:
BDBM281804
Synonyms:
N-(3,4-difluorobenzyl)-2-(((5-(1- methyl-1H-imidazo[4,5-c]quinolin- 8-yl)thiophen-2-yl)methyl)amino)- 5-(trifluoromethyl)nicotinamide | US10030016, Example 2.26
Type:
Small organic molecule
Emp. Form.:
C30H21F5N6OS
Mol. Mass.:
608.584
SMILES:
Cn1cnc2cnc3ccc(cc3c12)-c1ccc(CNc2ncc(cc2C(=O)NCc2ccc(F)c(F)c2)C(F)(F)F)s1
: