Target
3-phosphoinositide-dependent protein kinase 1 [51-359]
Ligand
BDBM281810
Substrate
Meas. Tech.
PDK1 kinase assay
IC50
<100±n/a nM
Citation
 Arndt, JChan, TGuckian, KKumaravel, GLee, WLin, EYScott, DSun, LThomas, Jvan Vloten, KWang, DZhang, LErlanson, D Heterocyclic compounds useful as PDK1 inhibitors US Patent  US10030016 Publication Date 7/24/2018 
Target
Name:
3-phosphoinositide-dependent protein kinase 1 [51-359]
Synonyms:
3-Phosphoinositide-Dependent Protein Kinase 1 (PDK1) 3-phosphoinositide-dependent protein kinase 1 (aa 51-359) PDK1 (aa 51-359) PDPK1_HUMAN | hPDK1
Type:
Enzyme Catalytic Domain
Mol. Mass.:
35302.26
Organism:
Homo sapiens (Human)
Description:
O15530[51-359]
Residue:
309
  
Inhibitor
Name:
BDBM281810
Synonyms:
2-(((5-(1H-pyrazolo[3,4-b]pyridin- 5-yl)thiophen-2-yl)methyl)amino)- N-(3,4-difluorobenzyl) nicotinamide | US10030016, Example 2.32
Type:
Small organic molecule
Emp. Form.:
C24H18F2N6OS
Mol. Mass.:
476.501
SMILES:
Fc1ccc(CNC(=O)c2cccnc2NCc2ccc(s2)-c2cnc3[nH]ncc3c2)cc1F
: