Target
3-phosphoinositide-dependent protein kinase 1 [51-359]
Ligand
BDBM281877
Substrate
Meas. Tech.
PDK1 kinase assay
IC50
<100±n/a nM
Citation
 Arndt, JChan, TGuckian, KKumaravel, GLee, WLin, EYScott, DSun, LThomas, Jvan Vloten, KWang, DZhang, LErlanson, D Heterocyclic compounds useful as PDK1 inhibitors US Patent  US10030016 Publication Date 7/24/2018 
Target
Name:
3-phosphoinositide-dependent protein kinase 1 [51-359]
Synonyms:
3-Phosphoinositide-Dependent Protein Kinase 1 (PDK1) 3-phosphoinositide-dependent protein kinase 1 (aa 51-359) PDK1 (aa 51-359) PDPK1_HUMAN | hPDK1
Type:
Enzyme Catalytic Domain
Mol. Mass.:
35302.26
Organism:
Homo sapiens (Human)
Description:
O15530[51-359]
Residue:
309
  
Inhibitor
Name:
BDBM281877
Synonyms:
2-({[5-(4-aminoquinazolin-6- yl)thiophen-2-yl]methyl} amino)-N-[(5- fluoropyridin-3-yl)methyl] pyridine-3-carboxamide (TFA salt) | US10030016, Example 3.65
Type:
Small organic molecule
Emp. Form.:
C25H20FN7OS
Mol. Mass.:
485.536
SMILES:
Nc1ncnc2ccc(cc12)-c1ccc(CNc2ncccc2C(=O)NCc2cncc(F)c2)s1
: