Target
3-phosphoinositide-dependent protein kinase 1 [51-359]
Ligand
BDBM282375
Substrate
Meas. Tech.
PDK1 kinase assay
IC50
<100±n/a nM
Citation
 Arndt, JChan, TGuckian, KKumaravel, GLee, WLin, EYScott, DSun, LThomas, Jvan Vloten, KWang, DZhang, LErlanson, D Heterocyclic compounds useful as PDK1 inhibitors US Patent  US10030016 Publication Date 7/24/2018 
Target
Name:
3-phosphoinositide-dependent protein kinase 1 [51-359]
Synonyms:
3-Phosphoinositide-Dependent Protein Kinase 1 (PDK1) 3-phosphoinositide-dependent protein kinase 1 (aa 51-359) PDK1 (aa 51-359) PDPK1_HUMAN | hPDK1
Type:
Enzyme Catalytic Domain
Mol. Mass.:
35302.26
Organism:
Homo sapiens (Human)
Description:
O15530[51-359]
Residue:
309
  
Inhibitor
Name:
BDBM282375
Synonyms:
(S)-5-cyano-N-(1-(4- fluorophenyl)ethyl)-2- (3-(2-(methylamino) quinazolin-6-yl)prop-2- ynylamino)nicotinamide | US10030016, Example 255
Type:
Small organic molecule
Emp. Form.:
C27H22FN7O
Mol. Mass.:
479.5083
SMILES:
CNc1ncc2cc(ccc2n1)C#CCNc1ncc(cc1C(=O)N[C@@H](C)c1ccc(F)cc1)C#N
: