Target
3-phosphoinositide-dependent protein kinase 1 [51-359]
Ligand
BDBM282456
Substrate
Meas. Tech.
PDK1 kinase assay
IC50
<100±n/a nM
Citation
 Arndt, JChan, TGuckian, KKumaravel, GLee, WLin, EYScott, DSun, LThomas, Jvan Vloten, KWang, DZhang, LErlanson, D Heterocyclic compounds useful as PDK1 inhibitors US Patent  US10030016 Publication Date 7/24/2018 
Target
Name:
3-phosphoinositide-dependent protein kinase 1 [51-359]
Synonyms:
3-Phosphoinositide-Dependent Protein Kinase 1 (PDK1) 3-phosphoinositide-dependent protein kinase 1 (aa 51-359) PDK1 (aa 51-359) PDPK1_HUMAN | hPDK1
Type:
Enzyme Catalytic Domain
Mol. Mass.:
35302.26
Organism:
Homo sapiens (Human)
Description:
O15530[51-359]
Residue:
309
  
Inhibitor
Name:
BDBM282456
Synonyms:
2-((4-(5-(1H-pyrrol-2-yl)-1H- pyrrolo[2,3-b]pyridin-2-yl) methylamino)-N-(3,4- difluorobenzyl)nicotinamide | US10030016, Example 336
Type:
Small organic molecule
Emp. Form.:
C30H23F2N7O
Mol. Mass.:
535.5467
SMILES:
Fc1ccc(CNC(=O)c2cccnc2NCc2cc(ccn2)-c2c[nH]c3ncc(cc23)-c2ccc[nH]2)cc1F
: