Target
Serine/threonine-protein kinase/endoribonuclease IRE1
Ligand
BDBM110974
Substrate
Meas. Tech.
In Vitro Enzyme Assays
pH
7.5±n/a
Temperature
303.15±n/a K
IC50
80±n/a nM
Citation
 Patterson, JBLonergan, DGFlynn, GAZeng, QPallai, PV IRE-1α inhibitors US Patent  US8614253 Publication Date 12/24/2013 
Target
Name:
Serine/threonine-protein kinase/endoribonuclease IRE1
Synonyms:
ERN1 Endoplasmic reticulum-to-nucleus signaling 1 IRE1 Inositol requiring enzyme 1 (IRE-1alpha) Inositol-requiring protein 1 Ire1-alpha Serine/threonine-protein kinase/endoribonuclease IRE1 hIRE1p
Type:
Enzyme
Mol. Mass.:
109731.20
Organism:
Homo sapiens (Human)
Description:
O75460
Residue:
977
  
Inhibitor
Name:
BDBM110974
Synonyms:
US8614253, 3-5 US9963434, Compound 3-5
Type:
Small organic molecule
Emp. Form.:
C8H7BrO3
Mol. Mass.:
231.043
SMILES:
COc1ccc(Br)c(C=O)c1O
: