Target
Serine/threonine-protein kinase/endoribonuclease IRE1
Ligand
BDBM111271
Substrate
Meas. Tech.
In Vitro Enzyme Assays
pH
7.5±n/a
Temperature
303.15±n/a K
IC50
88±n/a nM
Citation
 Patterson, JBLonergan, DGFlynn, GAZeng, QPallai, PV IRE-1α inhibitors US Patent  US8614253 Publication Date 12/24/2013 
Target
Name:
Serine/threonine-protein kinase/endoribonuclease IRE1
Synonyms:
ERN1 Endoplasmic reticulum-to-nucleus signaling 1 IRE1 Inositol requiring enzyme 1 (IRE-1alpha) Inositol-requiring protein 1 Ire1-alpha Serine/threonine-protein kinase/endoribonuclease IRE1 hIRE1p
Type:
Enzyme
Mol. Mass.:
109731.20
Organism:
Homo sapiens (Human)
Description:
O75460
Residue:
977
  
Inhibitor
Name:
BDBM111271
Synonyms:
US8614253, 43-31 | US9241942, 27-31
Type:
Small organic molecule
Emp. Form.:
C11H7FO3
Mol. Mass.:
206.1699
SMILES:
Oc1c(F)cc(cc1C=O)-c1ccoc1
: