Target
Leucine-rich repeat serine/threonine-protein kinase 2
Ligand
BDBM282573
Substrate
Meas. Tech.
In Vitro Kinase Activities (LRRK2 TR-FRET Peptide Assay)
pH
7.5±n/a
Temperature
298.15±n/a K
IC50
180±n/a nM
Comments
extracted
Citation
 Aubele, DLGarofalo, AWBowers, STruong, APYe, XMFranzini, MAdler, MNeitz, RJProbst, G Substituted cinnolines as inhibitors of LRRK2 kinase activity US Patent  US9884828 Publication Date 2/6/2018 
Target
Name:
Leucine-rich repeat serine/threonine-protein kinase 2
Synonyms:
Dardarin LRRK2_HUMAN Leucine-rich repeat serine/threonine-protein kinase 2 PARK8
Type:
Protein
Mol. Mass.:
286113.20
Organism:
Homo sapiens (Human)
Description:
Q5S007
Residue:
2527
  
Inhibitor
Name:
BDBM282573
Synonyms:
US9884828, 2-21
Type:
Small organic molecule
Emp. Form.:
C22H25N5O3S
Mol. Mass.:
439.531
SMILES:
CN1CCC(CC1)Nc1c(nnc2cc(ccc12)-c1ccc(cc1)S(C)(=O)=O)C(N)=O
: