Target
Leucine-rich repeat serine/threonine-protein kinase 2
Ligand
BDBM282676
Substrate
Meas. Tech.
In Vitro Kinase Activities (LRRK2 TR-FRET Peptide Assay)
pH
7.5±n/a
Temperature
298.15±n/a K
IC50
>1000±n/a nM
Comments
extracted
Citation
 Aubele, DLGarofalo, AWBowers, STruong, APYe, XMFranzini, MAdler, MNeitz, RJProbst, G Substituted cinnolines as inhibitors of LRRK2 kinase activity US Patent  US9884828 Publication Date 2/6/2018 
Target
Name:
Leucine-rich repeat serine/threonine-protein kinase 2
Synonyms:
Dardarin LRRK2_HUMAN Leucine-rich repeat serine/threonine-protein kinase 2 PARK8
Type:
Protein
Mol. Mass.:
286113.20
Organism:
Homo sapiens (Human)
Description:
Q5S007
Residue:
2527
  
Inhibitor
Name:
BDBM282676
Synonyms:
US9884828, 12-229
Type:
Small organic molecule
Emp. Form.:
C18H18N4O3S
Mol. Mass.:
370.426
SMILES:
CNC(=O)c1nnc2cc(ccc2c1NC)-c1ccc(cc1)S(C)(=O)=O
: