Target
5-hydroxytryptamine receptor 6
Ligand
BDBM50417917
Substrate
Meas. Tech.
Functional Assay
IC50
4±n/a nM
Citation
 Ivashchenko, AASavchuk, NFIvashchenko, AVLavrovsky, YMitkin, ODKadieva, MG Substituted 3-arylsulfonyl-pyrazolo[1,5-A]pyrimidines, serotonin 5-HT6 receptor antagonists and methods for the production and use thereof US Patent  US8618114 Publication Date 12/31/2013 
Target
Name:
5-hydroxytryptamine receptor 6
Synonyms:
5-HT-6 5-hydroxytryptamine receptor 6 (5-HT-6) 5-hydroxytryptamine receptor 6 (5HT6) HTR6 Serotonin 6 (5-HT6) receptor | Serotonin Receptor 6
Type:
G Protein-Coupled Receptor (GPCR)
Mol. Mass.:
46968.43
Organism:
Homo sapiens (Human)
Description:
P50406
Residue:
440
  
Inhibitor
Name:
BDBM50417917
Synonyms:
CHEMBL1668565 | US8618114, 1.2.6(1)
Type:
Small organic molecule
Emp. Form.:
C15H16N4O3S
Mol. Mass.:
332.378
SMILES:
CNc1nn2c(CO)cc(C)nc2c1S(=O)(=O)c1ccccc1
: