Target
Phospholipase A2
Ligand
BDBM111817
Substrate
Meas. Tech.
sPLA2-V activity assay
pH
8±n/a
Temperature
298.15±n/a K
IC50
1.018e+4± 7.4e+2 nM
Comments
extracted
Citation
 Ahmad, WKumolosasi, EJantan, IBukhari, SNJasamai, M Effects of novel diarylpentanoid analogues of curcumin on secretory phospholipase A2 , cyclooxygenases, lipo-oxygenase, and microsomal prostaglandin E synthase-1. Chem Biol Drug Des 83:670-81 (2014)  
Target
Name:
Phospholipase A2
Synonyms:
Group IB phospholipase A2 PLA2 PLA2G1B Phosphatidylcholine 2-acylhydrolase 1B Phospholipase A2 group 1B | phospholipase A2 precursor
Type:
Protein
Mol. Mass.:
16364.13
Organism:
Homo sapiens (Human)
Description:
P04054
Residue:
148
  
Inhibitor
Name:
BDBM111817
Synonyms:
2,5-Bis(4-diethylaminobenzylidene)cyclopentanone (17)
Type:
Small organic molecule
Emp. Form.:
C27H34N2O
Mol. Mass.:
402.5717
SMILES:
CCN(CC)c1ccc(\C=C2/CC\C(=C/c3ccc(cc3)N(CC)CC)C2=O)cc1
: