Target
High affinity cGMP-specific 3',5'-cyclic phosphodiesterase 9A
Ligand
BDBM111892
Substrate
Meas. Tech.
Scintillation Proximity Assay
pH
7.5±0
Temperature
273.15±0 K
IC50
5±0 nM
Citation
 Giovannini, RDorner-Ciossek, CEickmeier, CFiegen, DFox, TFuchs, KHeine, NRosenbrock, HSchaenzle, G Compounds for the treatment of CNS disorders US Patent  US8623901 Publication Date 1/7/2014 
Target
Name:
High affinity cGMP-specific 3',5'-cyclic phosphodiesterase 9A
Synonyms:
3',5'-cyclic phosphodiesterase PDE9A_HUMAN Phosphodiesterase 9A (PDE9) | Phosphodiesterase 9A (PDE9A)
Type:
Protein
Mol. Mass.:
68488.40
Organism:
Homo sapiens (Human)
Description:
O76083
Residue:
593
  
Inhibitor
Name:
BDBM111892
Synonyms:
US8623901, 220
Type:
Small organic molecule
Emp. Form.:
C23H23N5O3
Mol. Mass.:
417.4604
SMILES:
COc1cncc(c1)-c1ccccc1Cc1nc2n(ncc2c(=O)[nH]1)C1CCOCC1
: