Target
Receptor-type tyrosine-protein kinase FLT3
Ligand
BDBM112479
Substrate
Meas. Tech.
Kinase Assay
pH
7.6±n/a
IC50
144±n/a nM
Citation
 Chen, XDai, KDuquette, JGribble, Jr., MWHuard, JNKeegan, KSLi, ZLively, SEMcGee, LRRagains, MLWang, XWeidner, MFZhang, J Fused tricyclic dual inhibitors of CDK 4/6 and FLT3 US Patent  US8623885 Publication Date 1/7/2014 
Target
Name:
Receptor-type tyrosine-protein kinase FLT3
Synonyms:
CD135 FL cytokine receptor FLK2 FLT3 Fetal liver kinase-2 Fms-like tyrosine kinase 3 (Flt-3) STK-1 Stem cell tyrosine kinase 1
Type:
Enzyme
Mol. Mass.:
112888.62
Organism:
Homo sapiens (Human)
Description:
P36888
Residue:
993
  
Inhibitor
Name:
BDBM112479
Synonyms:
US8623885, 20
Type:
Small organic molecule
Emp. Form.:
C27H31N7O3
Mol. Mass.:
501.5801
SMILES:
COc1cc2c(cn1)n([C@H]1CC[C@H](C)CC1)c1nc(Nc3ccc4CN(CCc4n3)C(=O)CO)ncc21
: