Target
Epidermal growth factor receptor
Ligand
BDBM112498
Substrate
Meas. Tech.
ELISA-Based Kinase Assay
pH
7.4±n/a
Temperature
298.15±n/a K
IC50
6.44±0 nM
Comments
extracted
Citation
 Fakhoury, SALee, HTReed, JESchlosser, KMSexton, KETecle, HWinters, RT 4-phenylamino-quinazolin-6-yl-amides US Patent  US8623883 Publication Date 1/7/2014 
Target
Name:
Epidermal growth factor receptor
Synonyms:
EGF Receptor Substrate EGFR_HUMAN ERBB1 Epidermal Growth Factor Receptor erbB-1 Epidermal growth factor receptor (EGFR) HER1 Proto-oncogene c-ErbB-1 Tyrosine-Protein Kinase ErbB-1
Type:
Receptor Kinase Domain
Mol. Mass.:
134279.59
Organism:
Homo sapiens (Human)
Description:
P00533
Residue:
1210
  
Inhibitor
Name:
BDBM112498
Synonyms:
US8623883, No. 1
Type:
Small organic molecule
Emp. Form.:
C25H26ClF2N5O2
Mol. Mass.:
501.956
SMILES:
FCCOc1cc2ncnc(Nc3ccc(F)c(Cl)c3)c2cc1NC(=O)\C=C\CN1CCCCC1
: