Target
Receptor tyrosine-protein kinase erbB-4
Ligand
BDBM112504
Substrate
Meas. Tech.
ELISA-Based Kinase Assay
pH
7.4±n/a
Temperature
298.15±n/a K
IC50
41.33±0 nM
Comments
extracted
Citation
 Fakhoury, SALee, HTReed, JESchlosser, KMSexton, KETecle, HWinters, RT 4-phenylamino-quinazolin-6-yl-amides US Patent  US8623883 Publication Date 1/7/2014 
Target
Name:
Receptor tyrosine-protein kinase erbB-4
Synonyms:
ERBB4 Epidermal growth factor receptor ErbB-4 (HER4) Tyrosine Kinase Proto-oncogene c-ErbB-4 Receptor protein-tyrosine kinase erbB-4 Tyrosine kinase-type cell surface receptor HER4 (HER4)
Type:
Protein
Mol. Mass.:
146803.56
Organism:
Homo sapiens (Human)
Description:
Q15303
Residue:
1308
  
Inhibitor
Name:
BDBM112504
Synonyms:
US8623883, No. 10
Type:
Small organic molecule
Emp. Form.:
C25H27ClFN5O2
Mol. Mass.:
483.966
SMILES:
COc1cc2ncnc(Nc3ccc(F)c(Cl)c3)c2cc1NC(=O)\C=C\CN1CCCCCC1
: