Target
Tyrosine-protein kinase JAK3
Ligand
BDBM112598
Substrate
Meas. Tech.
Inhibition Assay
pH
7.2±n/a
Ki
0.00548±n/a nM
IC50
0.01096±n/a nM
Citation
 de Vicente Fidalgo, JHermann, JCLemoine, RLi, HLovey, AJSjogren, EBSoth, M Inhibitors of JAK US Patent  US8618103 Publication Date 12/31/2013 
Target
Name:
Tyrosine-protein kinase JAK3
Synonyms:
JAK-3 JAK3_HUMAN Janus kinase 3 (JAK3) L-JAK | Leukocyte janus kinase
Type:
Protein
Mol. Mass.:
125111.08
Organism:
Homo sapiens (Human)
Description:
P52333
Residue:
1124
  
Inhibitor
Name:
BDBM112598
Synonyms:
US8618103, I-94
Type:
Small organic molecule
Emp. Form.:
C20H28N8O3S
Mol. Mass.:
460.553
SMILES:
CC[C@@H](CO)Nc1ncc(c(N[C@H]2CCCN(C2)S(C)(=O)=O)n1)-c1cnc2[nH]ccc2n1
: