Target
Tyrosine-protein kinase JAK2
Ligand
BDBM112544
Substrate
Meas. Tech.
Inhibition Assay
pH
7.2±n/a
IC50
0.1543±n/a nM
Citation
 de Vicente Fidalgo, JHermann, JCLemoine, RLi, HLovey, AJSjogren, EBSoth, M Inhibitors of JAK US Patent  US8618103 Publication Date 12/31/2013 
Target
Name:
Tyrosine-protein kinase JAK2
Synonyms:
JAK-2 JAK2_HUMAN Janus kinase 2 (JAK2) | Janus kinase 2 (a protein tyrosine kinase)
Type:
Protein
Mol. Mass.:
130684.68
Organism:
Homo sapiens (Human)
Description:
O60674
Residue:
1132
  
Inhibitor
Name:
BDBM112544
Synonyms:
US8618103, I-40
Type:
Small organic molecule
Emp. Form.:
C21H25ClN6O2S
Mol. Mass.:
460.98
SMILES:
Cc1ccc(c(NC2CCCN(C2)S(=O)(=O)CC2CC2)n1)-c1cnc2[nH]cc(Cl)c2n1
: