Target
Tyrosine-protein kinase JAK2
Ligand
BDBM112558
Substrate
Meas. Tech.
Inhibition Assay
pH
7.2±n/a
IC50
1.2305±n/a nM
Citation
 de Vicente Fidalgo, JHermann, JCLemoine, RLi, HLovey, AJSjogren, EBSoth, M Inhibitors of JAK US Patent  US8618103 Publication Date 12/31/2013 
Target
Name:
Tyrosine-protein kinase JAK2
Synonyms:
JAK-2 JAK2_HUMAN Janus kinase 2 (JAK2) | Janus kinase 2 (a protein tyrosine kinase)
Type:
Protein
Mol. Mass.:
130684.68
Organism:
Homo sapiens (Human)
Description:
O60674
Residue:
1132
  
Inhibitor
Name:
BDBM112558
Synonyms:
US8618103, I-54
Type:
Small organic molecule
Emp. Form.:
C17H20N6O2S
Mol. Mass.:
372.445
SMILES:
CS(=O)(=O)N1CCC[C@@H](C1)Nc1ncccc1-c1cnc2cc[nH]c2n1
: