Target
Tyrosine-protein kinase JAK2
Ligand
BDBM112576
Substrate
Meas. Tech.
Inhibition Assay
pH
7.2±n/a
IC50
0.0646±n/a nM
Citation
 de Vicente Fidalgo, JHermann, JCLemoine, RLi, HLovey, AJSjogren, EBSoth, M Inhibitors of JAK US Patent  US8618103 Publication Date 12/31/2013 
Target
Name:
Tyrosine-protein kinase JAK2
Synonyms:
JAK-2 JAK2_HUMAN Janus kinase 2 (JAK2) | Janus kinase 2 (a protein tyrosine kinase)
Type:
Protein
Mol. Mass.:
130684.68
Organism:
Homo sapiens (Human)
Description:
O60674
Residue:
1132
  
Inhibitor
Name:
BDBM112576
Synonyms:
US8618103, I-72
Type:
Small organic molecule
Emp. Form.:
C20H27N7O4S2
Mol. Mass.:
493.603
SMILES:
CC(C)CS(=O)(=O)N1CCC[C@@H](C1)Nc1nc(ncc1-c1cnc2[nH]ccc2n1)S(C)(=O)=O
: