Target
Tyrosine-protein kinase JAK2
Ligand
BDBM112617
Substrate
Meas. Tech.
Inhibition Assay
pH
7.2±n/a
IC50
0.2168±n/a nM
Citation
 de Vicente Fidalgo, JHermann, JCLemoine, RLi, HLovey, AJSjogren, EBSoth, M Inhibitors of JAK US Patent  US8618103 Publication Date 12/31/2013 
Target
Name:
Tyrosine-protein kinase JAK2
Synonyms:
JAK-2 JAK2_HUMAN Janus kinase 2 (JAK2) | Janus kinase 2 (a protein tyrosine kinase)
Type:
Protein
Mol. Mass.:
130684.68
Organism:
Homo sapiens (Human)
Description:
O60674
Residue:
1132
  
Inhibitor
Name:
BDBM112617
Synonyms:
US8618103, I-113
Type:
Small organic molecule
Emp. Form.:
C22H31N9O2S
Mol. Mass.:
485.606
SMILES:
C[C@H]1C[C@@H](CN(C1)S(C)(=O)=O)Nc1nc(ncc1-c1cnc2[nH]ccc2n1)N1CCN(C)CC1
: