Target
Nicotinamide phosphoribosyltransferase
Ligand
BDBM50438936
Substrate
Meas. Tech.
NAMPT enzyme assay
pH
7.5±n/a
Temperature
298.15±n/a K
IC50
5±n/a nM
Comments
extracted
Citation
 Oh, AHo, YCZak, MLiu, YChen, XYuen, PWZheng, XLiu, YDragovich, PSWang, W Structural and biochemical analyses of the catalysis and potency impact of inhibitor phosphoribosylation by human nicotinamide phosphoribosyltransferase. Chembiochem 15:1121-30 (2014)  
Target
Name:
Nicotinamide phosphoribosyltransferase
Synonyms:
NAMPT NAmPRTase Nicotinamide phosphoribosyltransferase (NAMPT) PBEF1 | Pre-B-cell colony-enhancing factor 1
Type:
Enzyme
Mol. Mass.:
55524.98
Organism:
Homo sapiens (Human)
Description:
P43490
Residue:
491
  
Inhibitor
Name:
BDBM50438936
Synonyms:
CHEMBL2420629 | GNE-617
Type:
Small organic molecule
Emp. Form.:
C21H15F2N3O3S
Mol. Mass.:
427.424
SMILES:
Fc1cc(F)cc(c1)S(=O)(=O)c1ccc(CNC(=O)c2ccc3nccn3c2)cc1
: