Target
Cystathionine gamma-lyase
Ligand
BDBM112630
Substrate
Meas. Tech.
Human CSE enzyme assay
pH
7±n/a
Temperature
310.15±n/a K
IC50
>2.00e+5±n/a nM
Comments
extracted
Citation
 Ren, JZhang, YJin, HYu, JZhou, YWu, FZhang, W Novel inhibitors of human DOPA decarboxylase extracted from Euonymus glabra Roxb. ACS Chem Biol 9:897-903 (2014)  
Target
Name:
Cystathionine gamma-lyase
Synonyms:
CGL_HUMAN Cystathionine gamma-lyase (CSE) Gamma-cystathionase
Type:
Protein
Mol. Mass.:
44509.52
Organism:
Homo sapiens (Human)
Description:
P32929
Residue:
405
  
Inhibitor
Name:
BDBM112630
Synonyms:
Euonydiarylpropane C (3)
Type:
Small organic molecule
Emp. Form.:
C34H38O8
Mol. Mass.:
574.6607
SMILES:
COc1ccc(C(CCc2ccc(O)c(OC)c2)c2cc(CCCc3ccc(O)c(OC)c3)c(O)cc2OC)c(O)c1
: