Target
Cystathionine gamma-lyase
Ligand
BDBM112634
Substrate
Meas. Tech.
Human CSE enzyme assay
pH
7±n/a
Temperature
310.15±n/a K
IC50
>2.00e+5±n/a nM
Comments
extracted
Citation
 Ren, JZhang, YJin, HYu, JZhou, YWu, FZhang, W Novel inhibitors of human DOPA decarboxylase extracted from Euonymus glabra Roxb. ACS Chem Biol 9:897-903 (2014)  
Target
Name:
Cystathionine gamma-lyase
Synonyms:
CGL_HUMAN Cystathionine gamma-lyase (CSE) Gamma-cystathionase
Type:
Protein
Mol. Mass.:
44509.52
Organism:
Homo sapiens (Human)
Description:
P32929
Residue:
405
  
Inhibitor
Name:
BDBM112634
Synonyms:
Euonyquinone B (7)
Type:
Small organic molecule
Emp. Form.:
C34H34O10
Mol. Mass.:
602.6278
SMILES:
COc1cc(CC=C(c2cc(O)c(OC)cc2O)c2c(OC)cc3OC(CCc3c2O)c2ccc(O)c(OC)c2)ccc1O
: