Target
Vascular endothelial growth factor A
Ligand
BDBM282731
Substrate
Meas. Tech.
Scintillation Proximity Assay (SPA)
pH
7.5±n/a
IC50
120±n/a nM
Comments
extracted
Citation
 Dixon, DDGrina, JJosey, JARizzi, JPSchlachter, STWallace, EMWang, BWehn, PXu, RYang, H Cyclic sulfone and sulfoximine analogs and uses thereof US Patent  US9884843 Publication Date 2/6/2018 
Target
Name:
Vascular endothelial growth factor A
Synonyms:
VEGF VEGFA VPF Vascular endothelial growth factor A (VEGF) Vascular permeability factor
Type:
Protein
Mol. Mass.:
27063.81
Organism:
Homo sapiens (Human)
Description:
P15692
Residue:
232
  
Inhibitor
Name:
BDBM282731
Synonyms:
(R)-4-bromo-5-((5-chloropyridin-3-yl)oxy)-2,2- difluoro-3-hydroxy-2,3-dihydrobenzo[b]thiophene 1,1-dioxide | US9884843, Compound 75
Type:
Small organic molecule
Emp. Form.:
C13H7BrClF2NO4S
Mol. Mass.:
426.618
SMILES:
O[C@@H]1c2c(ccc(Oc3cncc(Cl)c3)c2Br)S(=O)(=O)C1(F)F
: