Target
Vascular endothelial growth factor A
Ligand
BDBM282741
Substrate
Meas. Tech.
Scintillation Proximity Assay (SPA)
pH
7.5±n/a
IC50
11.0±n/a nM
Comments
extracted
Citation
 Dixon, DDGrina, JJosey, JARizzi, JPSchlachter, STWallace, EMWang, BWehn, PXu, RYang, H Cyclic sulfone and sulfoximine analogs and uses thereof US Patent  US9884843 Publication Date 2/6/2018 
Target
Name:
Vascular endothelial growth factor A
Synonyms:
VEGF VEGFA VPF Vascular endothelial growth factor A (VEGF) Vascular permeability factor
Type:
Protein
Mol. Mass.:
27063.81
Organism:
Homo sapiens (Human)
Description:
P15692
Residue:
232
  
Inhibitor
Name:
BDBM282741
Synonyms:
(R)-3-((4-chloro-2,2-difluoro-3-hydroxy-1,1-dioxido- 2,3-dihydrobenzo[b]thiophen-5-yl)oxy)-5- fluorobenzonitrile | US9884843, Compound 85
Type:
Small organic molecule
Emp. Form.:
C15H7ClF3NO4S
Mol. Mass.:
389.734
SMILES:
O[C@@H]1c2c(ccc(Oc3cc(F)cc(c3)C#N)c2Cl)S(=O)(=O)C1(F)F
: