Target
Orexin receptor type 2
Ligand
BDBM112665
Substrate
Meas. Tech.
Radioligand Binding Assay
Ki
3.3±n/a nM
Citation
 Coleman, PJFraley, MESchreier, JD Disubstituted azepan orexin receptor antagonists US Patent  US8623863 Publication Date 1/7/2014 
Target
Name:
Orexin receptor type 2
Synonyms:
HCRTR2 OX2R_HUMAN Orexin receptor type 2 (OR-2) Orexin receptor type 2 (OX2R) Ox-2-R | Ox2-R
Type:
Protein
Mol. Mass.:
50710.53
Organism:
Homo sapiens (Human)
Description:
O43614
Residue:
444
  
Inhibitor
Name:
BDBM112665
Synonyms:
US8623863, 2-8
Type:
Small organic molecule
Emp. Form.:
C25H29FN4O2
Mol. Mass.:
436.5218
SMILES:
CC1CCCC(COc2ccc(F)c(C)c2)CN1C(=O)c1cc(C)ccc1-n1nccn1
: