Target
5-hydroxytryptamine receptor 6
Ligand
BDBM50314760
Substrate
Meas. Tech.
Competitive Binding Assay
pH
7.4±n/a
Temperature
303.15±n/a K
Ki
0.549±n/a nM
IC50
1.18±n/a nM
Citation
 Ivashchenko, AAIvashchenko, AVSavchuk, NF Substituted cycloalcano[e and d] pyrazolo [1,5-a]pyrimidines/antagonists of serotonin 5-HT6 receptors and methods for production and the use thereof US Patent  US8629154 Publication Date 1/14/2014 
Target
Name:
5-hydroxytryptamine receptor 6
Synonyms:
5-HT-6 5-hydroxytryptamine receptor 6 (5-HT-6) 5-hydroxytryptamine receptor 6 (5HT6) HTR6 Serotonin 6 (5-HT6) receptor | Serotonin Receptor 6
Type:
G Protein-Coupled Receptor (GPCR)
Mol. Mass.:
46968.43
Organism:
Homo sapiens (Human)
Description:
P50406
Residue:
440
  
Inhibitor
Name:
BDBM50314760
Synonyms:
2-(methylthio)-3-(phenylsulfonyl)-6,7,8,9-tetrahydropyrazolo[1,5-a]quinazoline US8629154, 1.2(1)
Type:
Small organic molecule
Emp. Form.:
C17H17N3O2S2
Mol. Mass.:
359.466
SMILES:
CSc1nn2c3CCCCc3cnc2c1S(=O)(=O)c1ccccc1
: