Target
E3 ubiquitin-protein ligase Mdm2
Ligand
BDBM112739
Substrate
Meas. Tech.
Binding Assay
IC50
<1000±n/a nM
Citation
 Wang, SSun, WAguilar, AGarcia-Echeverria, C Spiro-oxindole MDM2 antagonists US Patent  US8629141 Publication Date 1/14/2014 
Target
Name:
E3 ubiquitin-protein ligase Mdm2
Synonyms:
Double minute 2 protein E3 ubiquitin-protein ligase Mdm2 (p53-binding protein Mdm2) Human Double Minute 2 (HDM2) MDM2-MDMX p53-Binding Protein MDM2 | p53-binding protein
Type:
Oncoprotein
Mol. Mass.:
55196.54
Organism:
Homo sapiens (Human)
Description:
Q00987
Residue:
491
  
Inhibitor
Name:
BDBM112739
Synonyms:
US8629141, 6
Type:
Small organic molecule
Emp. Form.:
C28H33Cl2FN4O3
Mol. Mass.:
563.491
SMILES:
CCC1(CC)N[C@H]([C@H](c2cccc(Cl)c2F)[C@]11C(=O)Nc2cc(Cl)ccc12)C(=O)NCCN1CCOCC1
: