Target
E3 ubiquitin-protein ligase Mdm2
Ligand
BDBM112755
Substrate
Meas. Tech.
Binding Assay
IC50
<100±n/a nM
Citation
 Wang, SSun, WAguilar, AGarcia-Echeverria, C Spiro-oxindole MDM2 antagonists US Patent  US8629141 Publication Date 1/14/2014 
Target
Name:
E3 ubiquitin-protein ligase Mdm2
Synonyms:
Double minute 2 protein E3 ubiquitin-protein ligase Mdm2 (p53-binding protein Mdm2) Human Double Minute 2 (HDM2) MDM2-MDMX p53-Binding Protein MDM2 | p53-binding protein
Type:
Oncoprotein
Mol. Mass.:
55196.54
Organism:
Homo sapiens (Human)
Description:
Q00987
Residue:
491
  
Inhibitor
Name:
BDBM112755
Synonyms:
US8629141, 25
Type:
Small organic molecule
Emp. Form.:
C31H37Cl2FN4O4S
Mol. Mass.:
651.619
SMILES:
CS(=O)(=O)CCN1CCC(CC1)NC(=O)[C@@H]1NC2(CCCCC2)[C@]2([C@H]1c1cccc(Cl)c1F)C(=O)Nc1cc(Cl)ccc21
: