Target
Amine oxidase [flavin-containing] A
Ligand
BDBM15581
Substrate
Meas. Tech.
Activity Assay
IC50
27±n/a nM
Citation
 Giordani, ALanza, MCaselli, GMandelli, SZanzola, SMakovec, FRovati, LC 6-1H-imidazo-quinazoline and quinolines derivatives, new MAO inhibitors and imidazoline receptor ligands US Patent  US8633208 Publication Date 1/21/2014 
Target
Name:
Amine oxidase [flavin-containing] A
Synonyms:
AOFA_HUMAN MAO-A Monoamine oxidase Monoamine oxidase type A (MAO A) Monoamine oxidase type A (MAOA)
Type:
Protein
Mol. Mass.:
59689.53
Organism:
Homo sapiens (Human)
Description:
P21397
Residue:
527
  
Inhibitor
Name:
BDBM15581
Synonyms:
CHEMBL8706 CLORGILINE N-[3-(2,4-dichlorophenoxy)propyl]-N-methyl-prop-2-yn-1-amine US9603833, Clorgyline | [3-(2,4-dichlorophenoxy)propyl](methyl)prop-2-yn-1-ylamine
Type:
Small organic molecule
Emp. Form.:
C13H15Cl2NO
Mol. Mass.:
272.17
SMILES:
CN(CCCOc1ccc(Cl)cc1Cl)CC#C
: