Target
Tyrosine-protein kinase JAK2
Ligand
BDBM113217
Substrate
Meas. Tech.
Enzymatic Assay
pH
7.4±n/a
IC50
0.109±n/a nM
Comments
extracted
Citation
 Promo, MAXie, JAcker, BAHartmann, SJWolfson, SGHuang, HJacobsen, EJ Pyrrolo[2,3-D]pyrimidine compounds US Patent  US8633206 Publication Date 1/21/2014 
Target
Name:
Tyrosine-protein kinase JAK2
Synonyms:
JAK-2 JAK2_HUMAN Janus kinase 2 (JAK2) | Janus kinase 2 (a protein tyrosine kinase)
Type:
Protein
Mol. Mass.:
130684.68
Organism:
Homo sapiens (Human)
Description:
O60674
Residue:
1132
  
Inhibitor
Name:
BDBM113217
Synonyms:
US8633206, 136
Type:
Small organic molecule
Emp. Form.:
C19H30N6O2S
Mol. Mass.:
406.546
SMILES:
CN([C@H]1CC[C@H](CS(=O)(=O)N2CCN(C)CC2)CC1)c1ncnc2[nH]ccc12
: