Target
Tyrosine-protein kinase JAK2
Ligand
BDBM113219
Substrate
Meas. Tech.
Enzymatic Assay
pH
7.4±n/a
IC50
0.00767±n/a nM
Comments
extracted
Citation
 Promo, MAXie, JAcker, BAHartmann, SJWolfson, SGHuang, HJacobsen, EJ Pyrrolo[2,3-D]pyrimidine compounds US Patent  US8633206 Publication Date 1/21/2014 
Target
Name:
Tyrosine-protein kinase JAK2
Synonyms:
JAK-2 JAK2_HUMAN Janus kinase 2 (JAK2) | Janus kinase 2 (a protein tyrosine kinase)
Type:
Protein
Mol. Mass.:
130684.68
Organism:
Homo sapiens (Human)
Description:
O60674
Residue:
1132
  
Inhibitor
Name:
BDBM113219
Synonyms:
US8633206, 138
Type:
Small organic molecule
Emp. Form.:
C23H37N5O3S
Mol. Mass.:
463.637
SMILES:
CC(C)COC1CCCN(C1)S(=O)(=O)C[C@H]1CC[C@@H](CC1)N(C)c1ncnc2[nH]ccc12
: