Target
Tyrosine-protein kinase JAK1
Ligand
BDBM113179
Substrate
Meas. Tech.
Enzymatic Assay
pH
7.4±n/a
IC50
1.36±n/a nM
Comments
extracted
Citation
 Promo, MAXie, JAcker, BAHartmann, SJWolfson, SGHuang, HJacobsen, EJ Pyrrolo[2,3-D]pyrimidine compounds US Patent  US8633206 Publication Date 1/21/2014 
Target
Name:
Tyrosine-protein kinase JAK1
Synonyms:
JAK-1 JAK1A JAK1_HUMAN Janus kinase 1 (JAK1) | Janus kinase 1 JAK1
Type:
Protein
Mol. Mass.:
133293.73
Organism:
Homo sapiens (Human)
Description:
P23458
Residue:
1154
  
Inhibitor
Name:
BDBM113179
Synonyms:
US8633206, 97
Type:
Small organic molecule
Emp. Form.:
C24H32N6O3S2
Mol. Mass.:
516.679
SMILES:
CN([C@H]1CC[C@H](CS(=O)(=O)N2CC[C@@](O)(CSc3ccccn3)C2)CC1)c1ncnc2[nH]ccc12
: