Target
Isoform C of Beta-secretase 1 (BACE-I-457)
Ligand
BDBM113392
Substrate
Meas. Tech.
BACE Assay
IC50
3.9±n/a nM
Citation
 Cacatian, SClaremon, DADillard, LWFuchs, KHeine, NJia, LLeftheris, KMcKeever, BMorales-Ramos, ASingh, SBVenkatraman, SWu, GWu, ZXu, ZYuan, JZheng, Y Inhibitors of beta-secretase US Patent  US8633212 Publication Date 1/21/2014 
Target
Name:
Isoform C of Beta-secretase 1 (BACE-I-457)
Synonyms:
BACE BACE1_HUMAN Beta-secretase 1 (BACE-I-457) | KIAA1149
Type:
Enzyme
Mol. Mass.:
51006.30
Organism:
Homo sapiens (Human)
Description:
P56817-3
Residue:
457
  
Inhibitor
Name:
BDBM113392
Synonyms:
US10336717, Compound 578 US9212153, 578
Type:
Small organic molecule
Emp. Form.:
C24H27N3O3
Mol. Mass.:
405.4895
SMILES:
CO[C@H]1CC[C@@]2(Cc3ccc(Oc4ccccc4)cc3[C@]22N=C(N)N(C)C2=O)CC1
: