Target
Isoform C of Beta-secretase 1 (BACE-I-457)
Ligand
BDBM113246
Substrate
Meas. Tech.
Enzyme Assay
pH
4.5±n/a
Temperature
298.15±n/a K
IC50
21±n/a nM
Comments
extracted
Citation
 Cacatian, SClaremon, DADillard, LWFuchs, KHeine, NJia, LLeftheris, KMcKeever, BMorales-Ramos, ASingh, SBVenkatraman, SWu, GWu, ZXu, ZYuan, JZheng, Y Inhibitors of beta-secretase US Patent  US8633212 Publication Date 1/21/2014 
Target
Name:
Isoform C of Beta-secretase 1 (BACE-I-457)
Synonyms:
BACE BACE1_HUMAN Beta-secretase 1 (BACE-I-457) | KIAA1149
Type:
Enzyme
Mol. Mass.:
51006.30
Organism:
Homo sapiens (Human)
Description:
P56817-3
Residue:
457
  
Inhibitor
Name:
BDBM113246
Synonyms:
US10336717, Compound 24 US9212153, 24
Type:
Small organic molecule
Emp. Form.:
C23H29N3O2
Mol. Mass.:
379.4953
SMILES:
CCOC1CCC2(Cc3ccc(cc3C22ON(C)C(N)=N2)C#CC2CC2)CC1
: