Target
Isoform C of Beta-secretase 1 (BACE-I-457)
Ligand
BDBM113260
Substrate
Meas. Tech.
Enzyme Assay
pH
4.5±n/a
Temperature
298.15±n/a K
IC50
130.4±n/a nM
Comments
extracted
Citation
 Cacatian, SClaremon, DADillard, LWFuchs, KHeine, NJia, LLeftheris, KMcKeever, BMorales-Ramos, ASingh, SBVenkatraman, SWu, GWu, ZXu, ZYuan, JZheng, Y Inhibitors of beta-secretase US Patent  US8633212 Publication Date 1/21/2014 
Target
Name:
Isoform C of Beta-secretase 1 (BACE-I-457)
Synonyms:
BACE BACE1_HUMAN Beta-secretase 1 (BACE-I-457) | KIAA1149
Type:
Enzyme
Mol. Mass.:
51006.30
Organism:
Homo sapiens (Human)
Description:
P56817-3
Residue:
457
  
Inhibitor
Name:
BDBM113260
Synonyms:
US10336717, Compound 38 US9212153, 38
Type:
Small organic molecule
Emp. Form.:
C28H26F3N3O2
Mol. Mass.:
493.5201
SMILES:
CN1OC2(N=C1N)c1cc(ccc1CC21CCc2ccccc2CC1)-c1cccc(OC(F)(F)F)c1
: