Target
Isoform C of Beta-secretase 1 (BACE-I-457)
Ligand
BDBM113298
Substrate
Meas. Tech.
Enzyme Assay
pH
4.5±n/a
Temperature
298.15±n/a K
IC50
2.1±n/a nM
Comments
extracted
Citation
 Cacatian, SClaremon, DADillard, LWFuchs, KHeine, NJia, LLeftheris, KMcKeever, BMorales-Ramos, ASingh, SBVenkatraman, SWu, GWu, ZXu, ZYuan, JZheng, Y Inhibitors of beta-secretase US Patent  US8633212 Publication Date 1/21/2014 
Target
Name:
Isoform C of Beta-secretase 1 (BACE-I-457)
Synonyms:
BACE BACE1_HUMAN Beta-secretase 1 (BACE-I-457) | KIAA1149
Type:
Enzyme
Mol. Mass.:
51006.30
Organism:
Homo sapiens (Human)
Description:
P56817-3
Residue:
457
  
Inhibitor
Name:
BDBM113298
Synonyms:
US10336717, Compound 76 US9212153, 76
Type:
Small organic molecule
Emp. Form.:
C23H27N3O2
Mol. Mass.:
377.4794
SMILES:
COC1CCC2(Cc3ccc(cc3C22N=C(N)N(C)C2=O)C#CC2CC2)CC1
: