Target
Phosphatidylinositol 4,5-bisphosphate 3-kinase catalytic subunit alpha isoform
Ligand
BDBM113490
Substrate
Meas. Tech.
Biochemical Assay
pH
7.4±n/a
Temperature
298.15±n/a K
IC50
2.3±n/a nM
Citation
 Cheng, HBhumralkar, DDress, KRHoffman, JEJohnson, MCKania, RSLe, PTNambu, MDPairish, MAPlewe, MBTran, KT 4-methylpyridopyrimidinone compounds US Patent  US8633204 Publication Date 1/21/2014 
Target
Name:
Phosphatidylinositol 4,5-bisphosphate 3-kinase catalytic subunit alpha isoform
Synonyms:
P42336 PI3-kinase subunit p110-alpha PIK3CA Phosphatidylinositol 3-kinase alpha (PI3Kalpha) Phosphatidylinositol 4,5-bisphosphate 3-kinase (PI3K) Phosphatidylinositol 4,5-bisphosphate 3-kinase catalytic subunit alpha (PI3Kalpha) Phosphatidylinositol 4,5-bisphosphate 3-kinase catalytic subunit alpha isoform (PI3-Ka) Phosphatidylinositol 4,5-bisphosphate 3-kinase catalytic subunit alpha isoform (PI3K p110alpha) Phosphatidylinositol 4,5-bisphosphate 3-kinase catalytic subunit alpha isoform (PI3K-alpha) Phosphatidylinositol 4,5-bisphosphate 3-kinase catalytic subunit alpha isoform (PI3Kalpha p110alpha) Phosphatidylinositol 4,5-bisphosphate 3-kinase catalytic subunit alpha isoform (PIK3CA) Phosphatidylinositol-4,5-bisphosphate 3-kinase catalytic subunit alpha isoform Phosphoinositide 3-Kinase (PI3K), alpha Chain A Phosphoinositide 3-kinases (PI3K) PtdIns-3-kinase p110 | p110 alpha
Type:
Enzyme Subunit
Mol. Mass.:
124294.87
Organism:
Homo sapiens (Human)
Description:
P42336
Residue:
1068
  
Inhibitor
Name:
BDBM113490
Synonyms:
US8633204, 210
Type:
Small organic molecule
Emp. Form.:
C18H18N6O
Mol. Mass.:
334.3751
SMILES:
CC(C)n1c2nc(N)nc(C)c2cc(-c2cnc3[nH]ccc3c2)c1=O
: