Target
Alpha-galactosidase A
Ligand
BDBM113759
Substrate
Meas. Tech.
α-Gal A Assay
pH
5±0
IC50
3.4e+2± 47 nM
Citation
 Yu, YMena-Barragán, TMena-Barragán, KJohnson, JLDrury, JELieberman, RLNakasone, NNinomiya, HTsukimura, TSakuraba, HSuzuki, YNanba, EMellet, COGarcía Fernández, JMGarcía Fernández, K Molecular Basis of 1-Deoxygalactonojirimycin Arylthiourea Binding to Human a-Galactosidase A: Pharmacological Chaperoning Efficacy on Fabry Disease Mutants. ACS Chem Biol 9:1460-9 (2014)  
Target
Name:
Alpha-galactosidase A
Synonyms:
AGAL_HUMAN Alpha-D-galactoside galactohydrolase Alpha-glucosidase A (α-Gal A) INN=Agalsidase | Melibiase
Type:
Protein
Mol. Mass.:
48760.21
Organism:
Homo sapiens (Human)
Description:
Residue:
429
  
Inhibitor
Name:
BDBM113759
Synonyms:
DGJ-pF PhT
Type:
Small organic molecule
Emp. Form.:
C13H17FN2O4S
Mol. Mass.:
316.348
SMILES:
OC[C@@H]1[C@H](O)[C@H](O)[C@@H](O)CN1C(=S)Nc1ccc(F)cc1
: