Target
Acyl-homoserine lactone acylase PvdQ [A190E,F674L]
Ligand
BDBM50257750
Substrate
Meas. Tech.
PvdQ IC50 Assay
IC50
6.5e+4±n/a nM
Citation
 Wurst, JMDrake, EJTheriault, JRJewett, ITVerPlank, LPerez, JRDandapani, SPalmer, MMoskowitz, SMSchreiber, SLMunoz, BGulick, AM Identification of Inhibitors of PvdQ, an Enzyme Involved in the Synthesis of the Siderophore Pyoverdine. ACS Chem Biol 9:1536-44 (2014)  
Target
Name:
Acyl-homoserine lactone acylase PvdQ [A190E,F674L]
Synonyms:
PVDQ_PSEAE qsc112
Type:
Protein
Mol. Mass.:
84038.62
Organism:
Pseudomonas aeruginosa
Description:
Ntn hydrolase
Residue:
762
  
Inhibitor
Name:
BDBM50257750
Synonyms:
CHEMBL494325 SMER28 (2) | cid_1560402
Type:
Small organic molecule
Emp. Form.:
C11H10BrN3
Mol. Mass.:
264.121
SMILES:
Brc1ccc2ncnc(NCC=C)c2c1
: