Target
Disintegrin and metalloproteinase domain-containing protein 17
Ligand
BDBM113897
Substrate
Meas. Tech.
Counterscreen for exosite inhibitors of ADAM10: QFRET-based biochemical high throughput dose response assay to identify inhibitors of ADAM17
IC50
27869±n/a nM
Citation
 PubChem, PC Counterscreen for exosite inhibitors of ADAM10: QFRET-based biochemical high throughput dose response assay to identify inhibitors of ADAM17 PubChem Bioassay (2014)[AID] 
Target
Name:
Disintegrin and metalloproteinase domain-containing protein 17
Synonyms:
ADA17_HUMAN CSVP Disintegrin and metalloproteinase domain-containing protein 17 (ADAM17) TNF-alpha convertase TNF-alpha-converting enzyme (TACE) Tumor necrosis factor-α converting enzyme (TACE)
Type:
Enzyme
Mol. Mass.:
93007.89
Organism:
Homo sapiens (Human)
Description:
Residue:
824
  
Inhibitor
Name:
BDBM113897
Synonyms:
(2E)-4-ethyl-2-(2,3,3-trichloro-1-nitro-prop-2-enylidene)oxazolidine (2E)-4-ethyl-2-(2,3,3-trichloro-1-nitroprop-2-enylidene)oxazolidine MLS000724314 cid_6019211
Type:
Small organic molecule
Emp. Form.:
C8H9Cl3N2O3
Mol. Mass.:
287.528
SMILES:
CCC1COC(=[NH+]1)C(=C(/Cl)[C-](Cl)Cl)\[N+]([O-])=O
: