Target
Disintegrin and metalloproteinase domain-containing protein 17
Ligand
BDBM53156
Substrate
Meas. Tech.
Counterscreen for exosite inhibitors of ADAM10: QFRET-based biochemical high throughput dose response assay to identify inhibitors of ADAM17
IC50
12034±n/a nM
Citation
 PubChem, PC Counterscreen for exosite inhibitors of ADAM10: QFRET-based biochemical high throughput dose response assay to identify inhibitors of ADAM17 PubChem Bioassay (2014)[AID] 
Target
Name:
Disintegrin and metalloproteinase domain-containing protein 17
Synonyms:
ADA17_HUMAN CSVP Disintegrin and metalloproteinase domain-containing protein 17 (ADAM17) TNF-alpha convertase TNF-alpha-converting enzyme (TACE) Tumor necrosis factor-α converting enzyme (TACE)
Type:
Enzyme
Mol. Mass.:
93007.89
Organism:
Homo sapiens (Human)
Description:
Residue:
824
  
Inhibitor
Name:
BDBM53156
Synonyms:
(5E)-5-[(5-bromanyl-1H-indol-3-yl)methylidene]-1-(2,4-dimethoxyphenyl)-1,3-diazinane-2,4,6-trione (5E)-5-[(5-bromo-1H-indol-3-yl)methylene]-1-(2,4-dimethoxyphenyl)pyrimidine-2,4,6(1H,3H,5H)-trione MLS001196551 cid_16467505
Type:
Small organic molecule
Emp. Form.:
C21H16BrN3O5
Mol. Mass.:
470.273
SMILES:
COc1ccc(N2C(=O)NC(=O)C(=Cc3c[nH]c4ccc(Br)cc34)C2=O)c(OC)c1
: