Target
Disintegrin and metalloproteinase domain-containing protein 17
Ligand
BDBM100259
Substrate
Meas. Tech.
Counterscreen for exosite inhibitors of ADAM10: QFRET-based biochemical high throughput dose response assay to identify inhibitors of ADAM17
IC50
11786±n/a nM
Citation
 PubChem, PC Counterscreen for exosite inhibitors of ADAM10: QFRET-based biochemical high throughput dose response assay to identify inhibitors of ADAM17 PubChem Bioassay (2014)[AID] 
Target
Name:
Disintegrin and metalloproteinase domain-containing protein 17
Synonyms:
ADA17_HUMAN CSVP Disintegrin and metalloproteinase domain-containing protein 17 (ADAM17) TNF-alpha convertase TNF-alpha-converting enzyme (TACE) Tumor necrosis factor-α converting enzyme (TACE)
Type:
Enzyme
Mol. Mass.:
93007.89
Organism:
Homo sapiens (Human)
Description:
Residue:
824
  
Inhibitor
Name:
BDBM100259
Synonyms:
2-hydroxy-3-[(E)-3-(4-nitrophenyl)-1-oxoprop-2-enyl]-1-cyclohepta-2,4,6-trienone 2-hydroxy-3-[(E)-3-(4-nitrophenyl)prop-2-enoyl]cyclohepta-2,4,6-trien-1-one MLS002701851 cid_6302331
Type:
Small organic molecule
Emp. Form.:
C16H11NO5
Mol. Mass.:
297.2622
SMILES:
Oc1c(ccccc1=O)C(=O)\C=C\c1ccc(cc1)[N+]([O-])=O
: